Reaction Details
TargetHistamine H3 receptor
LigandBDBM50309842
Substrate/Competitorn/a
Meas. Tech.ChEMBL_611486 (CHEMBL1069468)
Ki 390±n/a nM
Citation Cole, DCGross, JLComery, TAAschmies, SHirst, WDKelley, CKim, JIKubek, KNing, XPlatt, BJRobichaud, AJSolvibile, WRStock, JRTawa, GWilliams, MJEllingboe, JW Benzimidazole- and indole-substituted 1,3'-bipyrrolidine benzamides as histamine H3 receptor antagonists. Bioorg Med Chem Lett20:1237-40 (2010) 
 
Histamine H3 receptor
Name:Histamine H3 receptor
Type:G Protein-Coupled Receptor (GPCR)
Mol. Mass.:48691.47
Organism:Homo sapiens (Human)
Description:Binding assays were using CHO cells stably expressing hH3R receptors.
Residue:445
BDBM50309842
NameBDBM50309842
Synonyms:(4-((1H-benzo[d]imidazol-1-yl)methyl)phenyl)(3-(dimethylamino)pyrrolidin-1-yl)methanone | CHEMBL589508
TypeSmall organic molecule
Emp. Form.C21H24N4O
Mol. Mass.348.4415
SMILESCN(C)C1CCN(C1)C(=O)c1ccc(Cn2cnc3ccccc23)cc1