Reaction Details
TargetFructose-1,6-bisphosphatase 1
LigandBDBM50310094
Substrate/Competitorn/a
Meas. Tech.ChEMBL_612215 (CHEMBL1074153)
IC50 1±n/a nM
Citation Tsukada, TTakahashi, MTakemoto, TKanno, OYamane, TKawamura, SNishi, T Structure-based drug design of tricyclic 8H-indeno[1,2-d][1,3]thiazoles as potent FBPase inhibitors. Bioorg Med Chem Lett20:1004-7 (2010) 
 
Fructose-1,6-bisphosphatase 1
Name:Fructose-1,6-bisphosphatase 1
Type:Protein
Mol. Mass.:36843.58
Organism:Homo sapiens (Human)
Description:Liver FBPase (P09467)
Residue:338
BDBM50310094
NameBDBM50310094
Synonyms:(7-carbamoyl-8H-indeno[1,2-d]thiazol-4-yloxy)methylphosphonic acid {[(7-carbamoyl-8H-indeno[1,2-d][1,3]thiazol-4-yl)oxy]methyl}phosphonic acid
TypeSmall organic molecule
Emp. Form.C12H11N2O5PS
Mol. Mass.326.265
SMILESNC(=O)c1ccc(OCP(O)(O)=O)c-2c1Cc1scnc-21