Reaction Details
TargetRenin
LigandBDBM50311803
Substrate/Competitorn/a
Meas. Tech.ChEMBL_619906 (CHEMBL1110296)
IC50 0.4±n/a nM
Citation Remen, LBezençon, ORichard-Bildstein, SBur, DPrade, LCorminboeuf, OBoss, CGrisostomi, CSifferlen, TStrickner, PHess, PDelahaye, STreiber, AWeller, TBinkert, CSteiner, BFischli, W New classes of potent and bioavailable human renin inhibitors. Bioorg Med Chem Lett19:6762-5 (2009) 
 
Renin
Name:Renin
Type:Enzyme
Mol. Mass.:45058.99
Organism:Homo sapiens (Human)
Description:n/a
Residue:406
BDBM50311803
NameBDBM50311803
Synonyms:(1S,5S)-7-(4-(3-(2-chloro-3,6-difluorophenoxy)propyl)phenyl)-N-cyclopropyl-N-(2,3-dichlorobenzyl)-3,9-diazabicyclo[3.3.1]non-6-ene-6-carboxamide | CHEMBL1076442
TypeSmall organic molecule
Emp. Form.C33H32Cl3F2N3O2
Mol. Mass.646.982
SMILESFc1ccc(F)c(OCCCc2ccc(cc2)C2=C([C@H]3CNC[C@H](C2)N3)C(=O)N(Cc2cccc(Cl)c2Cl)C2CC2)c1Cl