Reaction Details
TargetPeroxisome proliferator-activated receptor alpha
LigandBDBM50312417
Substrate/Competitorn/a
Meas. Tech.ChEMBL_620646 (CHEMBL1114854)
EC50>10000±n/a nM
Citation Epple, RCow, CXie, YAzimioara, MRusso, RWang, XWityak, JKaranewsky, DSTuntland, TNguyêñ-Trân, VTCuc Ngo, CHuang, DSaez, ESpalding, TGerken, AIskandar, MSeidel, HMTian, SS Novel bisaryl substituted thiazoles and oxazoles as highly potent and selective peroxisome proliferator-activated receptor delta agonists. J Med Chem53:77-105 (2010) 
 
Peroxisome proliferator-activated receptor alpha
Name:Peroxisome proliferator-activated receptor alpha
Type:Enzyme
Mol. Mass.:52222.08
Organism:Homo sapiens (Human)
Description:Q07869
Residue:468
BDBM50312417
NameBDBM50312417
Synonyms:2-(4-((5-(2-(Trifluoromethyl)phenyl)-4-(4-methoxyphenyl)-thiazol-2-yl)methoxy)-2-methylphenoxy)acetic Acid | CHEMBL1081751
TypeSmall organic molecule
Emp. Form.C27H22F3NO5S
Mol. Mass.529.527
SMILESCOc1ccc(cc1)-c1nc(COc2ccc(OCC(O)=O)c(C)c2)sc1-c1ccccc1C(F)(F)F