Reaction Details
TargetPeroxisome proliferator-activated receptor gamma
LigandBDBM50312450
Substrate/Competitorn/a
Meas. Tech.ChEMBL_620647 (CHEMBL1114855)
EC50>10000±n/a nM
Citation Epple, RCow, CXie, YAzimioara, MRusso, RWang, XWityak, JKaranewsky, DSTuntland, TNguyêñ-Trân, VTCuc Ngo, CHuang, DSaez, ESpalding, TGerken, AIskandar, MSeidel, HMTian, SS Novel bisaryl substituted thiazoles and oxazoles as highly potent and selective peroxisome proliferator-activated receptor delta agonists. J Med Chem53:77-105 (2010) 
 
Peroxisome proliferator-activated receptor gamma
Name:Peroxisome proliferator-activated receptor gamma
Type:Nuclear Receptor
Mol. Mass.:57613.46
Organism:Homo sapiens (Human)
Description:P37231
Residue:505
BDBM50312450
NameBDBM50312450
Synonyms:CHEMBL1080363 | {4-[4,5-Bis(4-methoxyphenyl)oxazol-2-ylmethoxy]-2-methylphenoxy}acetic Acid
TypeSmall organic molecule
Emp. Form.C27H25NO7
Mol. Mass.475.4899
SMILESCOc1ccc(cc1)-c1nc(COc2ccc(OCC(O)=O)c(C)c2)oc1-c1ccc(OC)cc1