Reaction Details
TargetPeroxisome proliferator-activated receptor gamma
LigandBDBM50126016
Substrate/Competitorn/a
Meas. Tech.ChEMBL_620647 (CHEMBL1114855)
EC50 100±n/a nM
Citation Epple, RCow, CXie, YAzimioara, MRusso, RWang, XWityak, JKaranewsky, DSTuntland, TNguyêñ-Trân, VTCuc Ngo, CHuang, DSaez, ESpalding, TGerken, AIskandar, MSeidel, HMTian, SS Novel bisaryl substituted thiazoles and oxazoles as highly potent and selective peroxisome proliferator-activated receptor delta agonists. J Med Chem53:77-105 (2010) 
 
Peroxisome proliferator-activated receptor gamma
Name:Peroxisome proliferator-activated receptor gamma
Type:Nuclear Receptor
Mol. Mass.:57613.46
Organism:Homo sapiens (Human)
Description:P37231
Residue:505
BDBM50126016
NameBDBM50126016
Synonyms:2-(3-chloro-4-(3-(3-ethyl-7-propylbenzo[d]isoxazol-6-yloxy)propylthio)phenyl)acetic acid {3-Chloro-4-[3-(3-ethyl-7-propyl-benzo[d]isoxazol-6-yloxy)-propylsulfanyl]-phenyl}-acetic acid
TypeSmall organic molecule
Emp. Form.C23H26ClNO4S
Mol. Mass.447.975
SMILESCCCc1c(OCCCSc2ccc(CC(O)=O)cc2Cl)ccc2c(CC)noc12