Reaction Details
TargetPeroxisome proliferator-activated receptor delta
LigandBDBM50312463
Substrate/Competitorn/a
Meas. Tech.ChEMBL_620648 (CHEMBL1114856)
EC50 3±n/a nM
Citation Epple, RCow, CXie, YAzimioara, MRusso, RWang, XWityak, JKaranewsky, DSTuntland, TNguyêñ-Trân, VTCuc Ngo, CHuang, DSaez, ESpalding, TGerken, AIskandar, MSeidel, HMTian, SS Novel bisaryl substituted thiazoles and oxazoles as highly potent and selective peroxisome proliferator-activated receptor delta agonists. J Med Chem53:77-105 (2010) 
 
Peroxisome proliferator-activated receptor delta
Name:Peroxisome proliferator-activated receptor delta
Type:Enzyme
Mol. Mass.:49910.45
Organism:Homo sapiens (Human)
Description:Q03181
Residue:441
BDBM50312463
NameBDBM50312463
Synonyms:2-(4-((cyclohexyl(2-(2,4-dichlorophenylamino)-2-oxoethyl)amino)methyl)-2-methylphenoxy)acetic acid | CHEMBL1081917
TypeSmall organic molecule
Emp. Form.C24H28Cl2N2O4
Mol. Mass.479.396
SMILESCc1cc(CN(CC(=O)Nc2ccc(Cl)cc2Cl)C2CCCCC2)ccc1OCC(O)=O