Reaction Details
TargetPeroxisome proliferator-activated receptor alpha
LigandBDBM50312465
Substrate/Competitorn/a
Meas. Tech.ChEMBL_620646 (CHEMBL1114854)
EC50>10000±n/a nM
Citation Epple, RCow, CXie, YAzimioara, MRusso, RWang, XWityak, JKaranewsky, DSTuntland, TNguyêñ-Trân, VTCuc Ngo, CHuang, DSaez, ESpalding, TGerken, AIskandar, MSeidel, HMTian, SS Novel bisaryl substituted thiazoles and oxazoles as highly potent and selective peroxisome proliferator-activated receptor delta agonists. J Med Chem53:77-105 (2010) 
 
Peroxisome proliferator-activated receptor alpha
Name:Peroxisome proliferator-activated receptor alpha
Type:Enzyme
Mol. Mass.:52222.08
Organism:Homo sapiens (Human)
Description:Q07869
Residue:468
BDBM50312465
NameBDBM50312465
Synonyms:2-(3-(4-(2-(3,5-dichlorophenoxy)ethylcarbamoyl)-5-phenylisoxazol-3-yl)phenyl)acetic acid | CHEMBL1075665
TypeSmall organic molecule
Emp. Form.C26H20Cl2N2O5
Mol. Mass.511.353
SMILESOC(=O)Cc1cccc(c1)-c1noc(c1C(=O)NCCOc1cc(Cl)cc(Cl)c1)-c1ccccc1