Reaction Details
TargetPeroxisome proliferator-activated receptor delta
LigandBDBM50312378
Substrate/Competitorn/a
Meas. Tech.ChEMBL_620648 (CHEMBL1114856)
EC50 190±n/a nM
Citation Epple, RCow, CXie, YAzimioara, MRusso, RWang, XWityak, JKaranewsky, DSTuntland, TNguyêñ-Trân, VTCuc Ngo, CHuang, DSaez, ESpalding, TGerken, AIskandar, MSeidel, HMTian, SS Novel bisaryl substituted thiazoles and oxazoles as highly potent and selective peroxisome proliferator-activated receptor delta agonists. J Med Chem53:77-105 (2010) 
 
Peroxisome proliferator-activated receptor delta
Name:Peroxisome proliferator-activated receptor delta
Type:Enzyme
Mol. Mass.:49910.45
Organism:Homo sapiens (Human)
Description:Q03181
Residue:441
BDBM50312378
NameBDBM50312378
Synonyms:2-(4-((4-(4-methoxyphenyl)-5-phenylthiazol-2-yl)methoxy)-2-methylphenoxy)acetic acid | CHEMBL1079504
TypeSmall organic molecule
Emp. Form.C26H23NO5S
Mol. Mass.461.53
SMILESCOc1ccc(cc1)-c1nc(COc2ccc(OCC(O)=O)c(C)c2)sc1-c1ccccc1