Reaction Details
TargetPeroxisome proliferator-activated receptor delta
LigandBDBM50312376
Substrate/Competitorn/a
Meas. Tech.ChEMBL_620648 (CHEMBL1114856)
EC50 2400±n/a nM
Citation Epple, RCow, CXie, YAzimioara, MRusso, RWang, XWityak, JKaranewsky, DSTuntland, TNguyêñ-Trân, VTCuc Ngo, CHuang, DSaez, ESpalding, TGerken, AIskandar, MSeidel, HMTian, SS Novel bisaryl substituted thiazoles and oxazoles as highly potent and selective peroxisome proliferator-activated receptor delta agonists. J Med Chem53:77-105 (2010) 
 
Peroxisome proliferator-activated receptor delta
Name:Peroxisome proliferator-activated receptor delta
Type:Enzyme
Mol. Mass.:49910.45
Organism:Homo sapiens (Human)
Description:Q03181
Residue:441
BDBM50312376
NameBDBM50312376
Synonyms:2-(2-methyl-4-((5-methyl-4-(4-(trifluoromethyl)phenyl)thiazol-2-yl)methoxy)phenoxy)acetic acid | CHEMBL1081591
TypeSmall organic molecule
Emp. Form.C21H18F3NO4S
Mol. Mass.437.432
SMILESCc1sc(COc2ccc(OCC(O)=O)c(C)c2)nc1-c1ccc(cc1)C(F)(F)F