Reaction Details
TargetPeroxisome proliferator-activated receptor delta
LigandBDBM50312391
Substrate/Competitorn/a
Meas. Tech.ChEMBL_620648 (CHEMBL1114856)
EC50 4710±n/a nM
Citation Epple, RCow, CXie, YAzimioara, MRusso, RWang, XWityak, JKaranewsky, DSTuntland, TNguyêñ-Trân, VTCuc Ngo, CHuang, DSaez, ESpalding, TGerken, AIskandar, MSeidel, HMTian, SS Novel bisaryl substituted thiazoles and oxazoles as highly potent and selective peroxisome proliferator-activated receptor delta agonists. J Med Chem53:77-105 (2010) 
 
Peroxisome proliferator-activated receptor delta
Name:Peroxisome proliferator-activated receptor delta
Type:Enzyme
Mol. Mass.:49910.45
Organism:Homo sapiens (Human)
Description:Q03181
Residue:441
BDBM50312391
NameBDBM50312391
Synonyms:2-(4-((4-(4-chlorophenyl)thiazol-2-yl)methoxy)-2-methylphenoxy)acetic acid | CHEMBL1075772
TypeSmall organic molecule
Emp. Form.C19H16ClNO4S
Mol. Mass.389.853
SMILESCc1cc(OCc2nc(cs2)-c2ccc(Cl)cc2)ccc1OCC(O)=O