Reaction Details
TargetPeroxisome proliferator-activated receptor delta
LigandBDBM50312452
Substrate/Competitorn/a
Meas. Tech.ChEMBL_620648 (CHEMBL1114856)
EC50 3300±n/a nM
Citation Epple, RCow, CXie, YAzimioara, MRusso, RWang, XWityak, JKaranewsky, DSTuntland, TNguyêñ-Trân, VTCuc Ngo, CHuang, DSaez, ESpalding, TGerken, AIskandar, MSeidel, HMTian, SS Novel bisaryl substituted thiazoles and oxazoles as highly potent and selective peroxisome proliferator-activated receptor delta agonists. J Med Chem53:77-105 (2010) 
 
Peroxisome proliferator-activated receptor delta
Name:Peroxisome proliferator-activated receptor delta
Type:Enzyme
Mol. Mass.:49910.45
Organism:Homo sapiens (Human)
Description:Q03181
Residue:441
BDBM50312452
NameBDBM50312452
Synonyms:2-(4-((4,5-Bis(4-methoxyphenyl)thiazol-2-ylthio)methyl)-3-chlorophenyl)acetic Acid | CHEMBL1080312
TypeSmall organic molecule
Emp. Form.C26H22ClNO5S2
Mol. Mass.528.04
SMILESCOc1ccc(cc1)-c1nc(SCc2ccc(OCC(O)=O)cc2Cl)sc1-c1ccc(OC)cc1