Reaction Details
TargetProstaglandin G/H synthase 2
LigandBDBM50035218
Substrate/Competitorn/a
Meas. Tech.ChEMBL_615363 (CHEMBL1103300)
IC50>4000±n/a nM
Citation Uddin, MJSmithson, DCBrown, KMCrews, BCConnelly, MZhu, FMarnett, LJGuy, RK Podophyllotoxin analogues active versus Trypanosoma brucei. Bioorg Med Chem Lett20:1787-91 (2010) 
 
Prostaglandin G/H synthase 2
Name:Prostaglandin G/H synthase 2
Type:Protein
Mol. Mass.:69020.39
Organism:Mus musculus (Mouse)
Description:Q05769
Residue:604
BDBM50035218
NameBDBM50035218
Synonyms:CHEMBL61 Podophyllinic acid lactone podophyllotoxin
TypeSmall organic molecule
Emp. Form.C22H22O8
Mol. Mass.414.4053
SMILESCOc1cc(cc(OC)c1OC)[C@H]1[C@@H]2[C@H](COC2=O)[C@@H](O)c2cc3OCOc3cc12