Reaction Details
TargetRAC-alpha serine/threonine-protein kinase
LigandBDBM50312925
Substrate/Competitorn/a
Meas. Tech.ChEMBL_615910 (CHEMBL1102924)
IC50 3800±n/a nM
Citation Zeng, QAllen, JGBourbeau, MPWang, XYao, GTadesse, SRider, JTYuan, CCHong, FTLee, MRZhang, SLofgren, JAFreeman, DJYang, SLi, CTominey, EHuang, XHoffman, DYamane, HKFotsch, CDominguez, CHungate, RZhang, X Azole-based inhibitors of AKT/PKB for the treatment of cancer. Bioorg Med Chem Lett20:1559-64 (2010) 
 
RAC-alpha serine/threonine-protein kinase
Name:RAC-alpha serine/threonine-protein kinase
Type:Enzyme
Mol. Mass.:55681.25
Organism:Homo sapiens (Human)
Description:P31749
Residue:480
BDBM50312925
NameBDBM50312925
Synonyms:(R)-4-(3-(isoquinolin-6-yl)isoxazol-5-yl)-1-(4-(trifluoromethyl)phenyl)butan-2-amine | CHEMBL1081105
TypeSmall organic molecule
Emp. Form.C23H20F3N3O
Mol. Mass.411.4196
SMILESN[C@H](CCc1cc(no1)-c1ccc2cnccc2c1)Cc1ccc(cc1)C(F)(F)F