Reaction Details
TargetTyrosine-protein kinase JAK2
LigandBDBM50312974
Substrate/Competitorn/a
Meas. Tech.ChEMBL_616101 (CHEMBL1102770)
IC50 110±n/a nM
Citation Gerspacher, MFuret, PPissot-Soldermann, CGaul, CHolzer, PVangrevelinghe, ELang, MErdmann, DRadimerski, TRegnier, CHChene, PDe Pover, AHofmann, FBaffert, FBuhl, TAichholz, RBlasco, FEndres, RTrappe, JDrueckes, P 2-Amino-aryl-7-aryl-benzoxazoles as potent, selective and orally available JAK2 inhibitors. Bioorg Med Chem Lett20:1724-7 (2010) 
 
Tyrosine-protein kinase JAK2
Name:Tyrosine-protein kinase JAK2
Type:Protein
Mol. Mass.:130684.68
Organism:Homo sapiens (Human)
Description:O60674
Residue:1132
BDBM50312974
NameBDBM50312974
Synonyms:7-(pyridin-2-yl)-N-(3,4,5-trimethoxyphenyl)benzo[d]oxazol-2-amine | CHEMBL1081443
TypeSmall organic molecule
Emp. Form.C21H19N3O4
Mol. Mass.377.3933
SMILESCOc1cc(Nc2nc3cccc(-c4ccccn4)c3o2)cc(OC)c1OC