Reaction Details
TargetTyrosine-protein kinase JAK2
LigandBDBM50312978
Substrate/Competitorn/a
Meas. Tech.ChEMBL_616101 (CHEMBL1102770)
IC50 8±n/a nM
Citation Gerspacher, MFuret, PPissot-Soldermann, CGaul, CHolzer, PVangrevelinghe, ELang, MErdmann, DRadimerski, TRegnier, CHChene, PDe Pover, AHofmann, FBaffert, FBuhl, TAichholz, RBlasco, FEndres, RTrappe, JDrueckes, P 2-Amino-aryl-7-aryl-benzoxazoles as potent, selective and orally available JAK2 inhibitors. Bioorg Med Chem Lett20:1724-7 (2010) 
 
Tyrosine-protein kinase JAK2
Name:Tyrosine-protein kinase JAK2
Type:Protein
Mol. Mass.:130684.68
Organism:Homo sapiens (Human)
Description:O60674
Residue:1132
BDBM50312978
NameBDBM50312978
Synonyms:7-(quinolin-6-yl)-N-(3,4,5-trimethoxyphenyl)benzo[d]oxazol-2-amine | CHEMBL1081975
TypeSmall organic molecule
Emp. Form.C25H21N3O4
Mol. Mass.427.4519
SMILESCOc1cc(Nc2nc3cccc(-c4ccc5ncccc5c4)c3o2)cc(OC)c1OC