Reaction Details
TargetNon-receptor tyrosine-protein kinase TYK2
LigandBDBM50312982
Substrate/Competitorn/a
Meas. Tech.ChEMBL_616104 (CHEMBL1102773)
IC50 63±n/a nM
Citation Gerspacher, MFuret, PPissot-Soldermann, CGaul, CHolzer, PVangrevelinghe, ELang, MErdmann, DRadimerski, TRegnier, CHChene, PDe Pover, AHofmann, FBaffert, FBuhl, TAichholz, RBlasco, FEndres, RTrappe, JDrueckes, P 2-Amino-aryl-7-aryl-benzoxazoles as potent, selective and orally available JAK2 inhibitors. Bioorg Med Chem Lett20:1724-7 (2010) 
 
Non-receptor tyrosine-protein kinase TYK2
Name:Non-receptor tyrosine-protein kinase TYK2
Type:Protein
Mol. Mass.:133666.03
Organism:Homo sapiens (Human)
Description:P29597
Residue:1187
BDBM50312982
NameBDBM50312982
Synonyms:(2-fluoro-4-(2-(3,4,5-trimethoxyphenylamino)benzo[d]oxazol-7-yl)phenyl)(morpholino)methanone | CHEMBL1081484
TypeSmall organic molecule
Emp. Form.C27H26FN3O6
Mol. Mass.507.5102
SMILESCOc1cc(Nc2nc3cccc(-c4ccc(C(=O)N5CCOCC5)c(F)c4)c3o2)cc(OC)c1OC