Reaction Details
TargetTyrosine-protein kinase JAK1
LigandBDBM50312986
Substrate/Competitorn/a
Meas. Tech.ChEMBL_616102 (CHEMBL1102771)
IC50 140±n/a nM
Citation Gerspacher, MFuret, PPissot-Soldermann, CGaul, CHolzer, PVangrevelinghe, ELang, MErdmann, DRadimerski, TRegnier, CHChene, PDe Pover, AHofmann, FBaffert, FBuhl, TAichholz, RBlasco, FEndres, RTrappe, JDrueckes, P 2-Amino-aryl-7-aryl-benzoxazoles as potent, selective and orally available JAK2 inhibitors. Bioorg Med Chem Lett20:1724-7 (2010) 
 
Tyrosine-protein kinase JAK1
Name:Tyrosine-protein kinase JAK1
Type:Protein
Mol. Mass.:133293.73
Organism:Homo sapiens (Human)
Description:P23458
Residue:1154
BDBM50312986
NameBDBM50312986
Synonyms:4-(7-(3,5-difluoro-4-(morpholinomethyl)phenyl)benzo[d]oxazol-2-ylamino)-N,N,2-trimethylbenzamide | CHEMBL1080159
TypeSmall organic molecule
Emp. Form.C28H28F2N4O3
Mol. Mass.506.5437
SMILESCN(C)C(=O)c1ccc(Nc2nc3cccc(-c4cc(F)c(CN5CCOCC5)c(F)c4)c3o2)cc1C