Reaction Details
TargetTyrosine-protein kinase JAK2
LigandBDBM50312987
Substrate/Competitorn/a
Meas. Tech.ChEMBL_616101 (CHEMBL1102770)
IC50 5±n/a nM
Citation Gerspacher, MFuret, PPissot-Soldermann, CGaul, CHolzer, PVangrevelinghe, ELang, MErdmann, DRadimerski, TRegnier, CHChene, PDe Pover, AHofmann, FBaffert, FBuhl, TAichholz, RBlasco, FEndres, RTrappe, JDrueckes, P 2-Amino-aryl-7-aryl-benzoxazoles as potent, selective and orally available JAK2 inhibitors. Bioorg Med Chem Lett20:1724-7 (2010) 
 
Tyrosine-protein kinase JAK2
Name:Tyrosine-protein kinase JAK2
Type:Protein
Mol. Mass.:130684.68
Organism:Homo sapiens (Human)
Description:O60674
Residue:1132
BDBM50312987
NameBDBM50312987
Synonyms:4-(7-(3,5-difluoro-4-(morpholinomethyl)phenyl)benzo[d]oxazol-2-ylamino)-N,2-dimethylbenzamide | CHEMBL1082022
TypeSmall organic molecule
Emp. Form.C27H26F2N4O3
Mol. Mass.492.5171
SMILESCNC(=O)c1ccc(Nc2nc3cccc(-c4cc(F)c(CN5CCOCC5)c(F)c4)c3o2)cc1C