Reaction Details
Target5-hydroxytryptamine receptor 2A
LigandBDBM50313284
Substrate/Competitorn/a
Meas. Tech.ChEMBL_617120 (CHEMBL1101378)
Ki 86±n/a nM
Citation Kang, SYPark, EJPark, WKKim, HJJeong, DJung, MESong, KSLee, SHSeo, HJKim, MJLee, MHan, HKSon, EJPae, ANKim, JLee, J Arylpiperazine-containing pyrrole 3-carboxamide derivatives targeting serotonin 5-HT(2A), 5-HT(2C), and the serotonin transporter as a potential antidepressant. Bioorg Med Chem Lett20:1705-11 (2010) 
 
5-hydroxytryptamine receptor 2A
Name:5-hydroxytryptamine receptor 2A
Type:undefined
Mol. Mass.:52607.65
Organism:Homo sapiens (Human)
Description:P28223
Residue:471
BDBM50313284
NameBDBM50313284
Synonyms:(S)-2-((7-fluoro-2,3-dihydro-1H-inden-4-yloxy)methyl)morpholine CHEMBL1822892 | YM-35992
TypeSmall organic molecule
Emp. Form.C14H18FNO2
Mol. Mass.251.2966
SMILESFc1ccc(OC[C@@H]2CNCCO2)c2CCCc12