Reaction Details
TargetSubstance-P receptor
LigandBDBM50313630
Substrate/Competitorn/a
Meas. Tech.ChEMBL_614439 (CHEMBL1110509)
IC50 0.06±n/a nM
Citation Morriello, GJMills, SGJohnson, TReibarkh, MChicchi, GDeMartino, JKurtz, MDavies, PTsao, KLZheng, STong, XCarlson, ETownson, KTattersall, FDWheeldon, ABoyce, SCollinson, NRupniak, NMoore, SDeVita, RJ Substituted fused bicyclic pyrrolizinones as potent, orally bioavailable hNK1 antagonists. Bioorg Med Chem Lett20:2007-12 (2010) 
 
Substance-P receptor
Name:Substance-P receptor
Type:G Protein-Coupled Receptor (GPCR)
Mol. Mass.:46254.43
Organism:Homo sapiens (Human)
Description:P25103
Residue:407
BDBM50313630
NameBDBM50313630
Synonyms:(6R,7S,7aS)-2-((1H-pyrazol-5-yl)methylamino)-6-((R)-1-(3,5-bis(trifluoromethyl)phenyl)ethoxy)-7-(4-fluorophenyl)tetrahydro-1H-pyrrolizin-3(2H)-one | CHEMBL1077241
TypeSmall organic molecule
Emp. Form.C27H25F7N4O2
Mol. Mass.570.5018
SMILESC[C@@H](O[C@H]1CN2[C@@H](CC(NCc3ccn[nH]3)C2=O)[C@@H]1c1ccc(F)cc1)c1cc(cc(c1)C(F)(F)F)C(F)(F)F