Reaction Details
TargetSubstance-P receptor
LigandBDBM50313629
Substrate/Competitorn/a
Meas. Tech.ChEMBL_614440 (CHEMBL1110510)
IC50 1.9±n/a nM
Citation Morriello, GJMills, SGJohnson, TReibarkh, MChicchi, GDeMartino, JKurtz, MDavies, PTsao, KLZheng, STong, XCarlson, ETownson, KTattersall, FDWheeldon, ABoyce, SCollinson, NRupniak, NMoore, SDeVita, RJ Substituted fused bicyclic pyrrolizinones as potent, orally bioavailable hNK1 antagonists. Bioorg Med Chem Lett20:2007-12 (2010) 
 
Substance-P receptor
Name:Substance-P receptor
Type:G Protein-Coupled Receptor (GPCR)
Mol. Mass.:46254.43
Organism:Homo sapiens (Human)
Description:P25103
Residue:407
BDBM50313629
NameBDBM50313629
Synonyms:(6R,7S,7aS)-6-((R)-1-(3,5-bis(trifluoromethyl)phenyl)ethoxy)-7-(4-fluorophenyl)-2-(4H-1,2,4-triazol-4-yl)tetrahydro-1H-pyrrolizin-3(2H)-one | CHEMBL1082896
TypeSmall organic molecule
Emp. Form.C25H21F7N4O2
Mol. Mass.542.4487
SMILESC[C@@H](O[C@H]1CN2[C@@H](CC(C2=O)n2cnnc2)[C@@H]1c1ccc(F)cc1)c1cc(cc(c1)C(F)(F)F)C(F)(F)F