Reaction Details
TargetCysteine protease
LigandBDBM50314127
Substrate/Competitorn/a
Meas. Tech.ChEMBL_623874 (CHEMBL1105397)
Ki 1400±n/a nM
Citation Breuning, ADegel, BSchulz, FBüchold, CStempka, MMachon, UHeppner, SGelhaus, CLeippe, MLeyh, MKisker, CRath, JStich, AGut, JRosenthal, PJSchmuck, CSchirmeister, T Michael acceptor based antiplasmodial and antitrypanosomal cysteine protease inhibitors with unusual amino acids. J Med Chem53:1951-63 (2010) 
 
Cysteine protease
Name:Cysteine protease
Synonyms:Rhodesain
Type:PROTEIN
Mol. Mass.:48425.78
Organism:Trypanosoma brucei rhodesiense
Description:ChEMBL_619861
Residue:450
BDBM50314127
NameBDBM50314127
TypeSmall organic molecule
Emp. Form.C32H33N3O7
Mol. Mass.571.6203
SMILESC[C@H](NC(=O)[C@H](Cc1ccccc1)NC(=O)\C=C/C(=O)N[C@@H](Cc1ccccc1)C(=O)OCc1ccccc1)C(O)=O