Reaction Details
TargetDeath-associated protein kinase 3
LigandBDBM50314663
Substrate/Competitorn/a
Meas. Tech.ChEMBL_625624 (CHEMBL1112575)
IC50 583±n/a nM
Citation Okamoto, MTakayama, KShimizu, TMuroya, AFuruya, T Structure-activity relationship of novel DAPK inhibitors identified by structure-based virtual screening. Bioorg Med Chem18:2728-34 (2010) 
 
Death-associated protein kinase 3
Name:Death-associated protein kinase 3
Type:PROTEIN
Mol. Mass.:52537.07
Organism:Homo sapiens (Human)
Description:ChEMBL_586564
Residue:454
BDBM50314663
NameBDBM50314663
Synonyms:2-phenyl-4-(pyridin-3-ylmethylene)oxazol-5(4H)-one CHEMBL579387
TypeSmall organic molecule
Emp. Form.C15H10N2O2
Mol. Mass.250.2521
SMILESO=C1OC(=N\C1=C/c1cccnc1)c1ccccc1