Reaction Details
TargetDeath-associated protein kinase 3
LigandBDBM50314669
Substrate/Competitorn/a
Meas. Tech.ChEMBL_625624 (CHEMBL1112575)
IC50 359.60±n/a nM
Citation Okamoto, MTakayama, KShimizu, TMuroya, AFuruya, T Structure-activity relationship of novel DAPK inhibitors identified by structure-based virtual screening. Bioorg Med Chem18:2728-34 (2010) 
 
Death-associated protein kinase 3
Name:Death-associated protein kinase 3
Type:PROTEIN
Mol. Mass.:52537.07
Organism:Homo sapiens (Human)
Description:ChEMBL_586564
Residue:454
BDBM50314669
NameBDBM50314669
Synonyms:2-(3-chlorophenyl)-4-(pyridin-3-ylmethylene)oxazol-5(4H)-one | CHEMBL1091765
TypeSmall organic molecule
Emp. Form.C15H9ClN2O2
Mol. Mass.284.697
SMILESClc1cccc(c1)C1=N\C(=C/c2cccnc2)C(=O)O1