Reaction Details
TargetDeath-associated protein kinase 3
LigandBDBM50314670
Substrate/Competitorn/a
Meas. Tech.ChEMBL_625624 (CHEMBL1112575)
IC50 278.5±n/a nM
Citation Okamoto, MTakayama, KShimizu, TMuroya, AFuruya, T Structure-activity relationship of novel DAPK inhibitors identified by structure-based virtual screening. Bioorg Med Chem18:2728-34 (2010) 
 
Death-associated protein kinase 3
Name:Death-associated protein kinase 3
Type:PROTEIN
Mol. Mass.:52537.07
Organism:Homo sapiens (Human)
Description:ChEMBL_586564
Residue:454
BDBM50314670
NameBDBM50314670
Synonyms:2-(4-bromo-3-methylphenyl)-4-(pyridin-3-ylmethylene)oxazol-5(4H)-one | CHEMBL1091766
TypeSmall organic molecule
Emp. Form.C16H11BrN2O2
Mol. Mass.343.175
SMILESCc1cc(ccc1Br)C1=N\C(=C/c2cccnc2)C(=O)O1