Reaction Details
TargetDeath-associated protein kinase 3
LigandBDBM50314673
Substrate/Competitorn/a
Meas. Tech.ChEMBL_625624 (CHEMBL1112575)
IC50 157±n/a nM
Citation Okamoto, MTakayama, KShimizu, TMuroya, AFuruya, T Structure-activity relationship of novel DAPK inhibitors identified by structure-based virtual screening. Bioorg Med Chem18:2728-34 (2010) 
 
Death-associated protein kinase 3
Name:Death-associated protein kinase 3
Type:PROTEIN
Mol. Mass.:52537.07
Organism:Homo sapiens (Human)
Description:ChEMBL_586564
Residue:454
BDBM50314673
NameBDBM50314673
Synonyms:2-(2-bromo-4-methoxyphenyl)-4-(pyridin-3-ylmethylene)oxazol-5(4H)-one | CHEMBL1091042
TypeSmall organic molecule
Emp. Form.C16H11BrN2O3
Mol. Mass.359.174
SMILESCOc1ccc(C2=N\C(=C/c3cccnc3)C(=O)O2)c(Br)c1