Reaction Details
TargetPeptidyl-prolyl cis-trans isomerase NIMA-interacting 1
LigandBDBM50314682
Substrate/Competitorn/a
Meas. Tech.ChEMBL_625852 (CHEMBL1109788)
Ki 1800±n/a nM
Citation Dong, LMarakovits, JHou, XGuo, CGreasley, SDagostino, EFerre, RJohnson, MCKraynov, EThomson, JPathak, VMurray, BW Structure-based design of novel human Pin1 inhibitors (II). Bioorg Med Chem Lett20:2210-4 (2010) 
 
Peptidyl-prolyl cis-trans isomerase NIMA-interacting 1
Name:Peptidyl-prolyl cis-trans isomerase NIMA-interacting 1
Type:PROTEIN
Mol. Mass.:18248.11
Organism:Homo sapiens (Human)
Description:ChEMBL_1502595
Residue:163
BDBM50314682
NameBDBM50314682
Synonyms:(R)-2-(2-naphthamido)-3-(3-(trifluoromethyl)phenyl)propanoic acid | CHEMBL1091805
TypeSmall organic molecule
Emp. Form.C21H16F3NO3
Mol. Mass.387.3518
SMILESOC(=O)[C@@H](Cc1cccc(c1)C(F)(F)F)NC(=O)c1ccc2ccccc2c1