Reaction Details
TargetPeptidyl-prolyl cis-trans isomerase NIMA-interacting 1
LigandBDBM50314708
Substrate/Competitorn/a
Meas. Tech.ChEMBL_625853 (CHEMBL1109789)
IC50>50000±n/a nM
Citation Dong, LMarakovits, JHou, XGuo, CGreasley, SDagostino, EFerre, RJohnson, MCKraynov, EThomson, JPathak, VMurray, BW Structure-based design of novel human Pin1 inhibitors (II). Bioorg Med Chem Lett20:2210-4 (2010) 
 
Peptidyl-prolyl cis-trans isomerase NIMA-interacting 1
Name:Peptidyl-prolyl cis-trans isomerase NIMA-interacting 1
Type:PROTEIN
Mol. Mass.:18248.11
Organism:Homo sapiens (Human)
Description:ChEMBL_1502595
Residue:163
BDBM50314708
NameBDBM50314708
Synonyms:(R)-2-(2-naphthamido)-5-cyclohexenylpent-4-enoic acid | CHEMBL1091060
TypeSmall organic molecule
Emp. Form.C22H23NO3
Mol. Mass.349.4229
SMILESOC(=O)[C@@H](C\C=C\C1=CCCCC1)NC(=O)c1ccc2ccccc2c1