Reaction Details
TargetPeptidyl-prolyl cis-trans isomerase NIMA-interacting 1
LigandBDBM50314710
Substrate/Competitorn/a
Meas. Tech.ChEMBL_625852 (CHEMBL1109788)
Ki 2800±n/a nM
Citation Dong, LMarakovits, JHou, XGuo, CGreasley, SDagostino, EFerre, RJohnson, MCKraynov, EThomson, JPathak, VMurray, BW Structure-based design of novel human Pin1 inhibitors (II). Bioorg Med Chem Lett20:2210-4 (2010) 
 
Peptidyl-prolyl cis-trans isomerase NIMA-interacting 1
Name:Peptidyl-prolyl cis-trans isomerase NIMA-interacting 1
Type:PROTEIN
Mol. Mass.:18248.11
Organism:Homo sapiens (Human)
Description:ChEMBL_1502595
Residue:163
BDBM50314710
NameBDBM50314710
Synonyms:(R)-2-(2-naphthamido)-3-m-tolylpropanoic acid | CHEMBL1091064
TypeSmall organic molecule
Emp. Form.C21H19NO3
Mol. Mass.333.3805
SMILESCc1cccc(C[C@@H](NC(=O)c2ccc3ccccc3c2)C(O)=O)c1