Reaction Details
TargetBeta-secretase 1
LigandBDBM50315002
Substrate/Competitorn/a
Meas. Tech.ChEMBL_624424 (CHEMBL1108752)
IC50 850±n/a nM
Citation Malamas, MSBarnes, KHui, YJohnson, MLovering, FCondon, JFobare, WSolvibile, WTurner, JHu, YManas, ESFan, KOlland, AChopra, RBard, JPangalos, MNReinhart, PRobichaud, AJ Novel pyrrolyl 2-aminopyridines as potent and selective human beta-secretase (BACE1) inhibitors. Bioorg Med Chem Lett20:2068-73 (2010) 
 
Beta-secretase 1
Name:Beta-secretase 1
Type:Protein
Mol. Mass.:55755.10
Organism:Homo sapiens (Human)
Description:P56817
Residue:501
BDBM50315002
NameBDBM50315002
Synonyms:6-((2-(2-chlorophenyl)-5-(4-phenoxyphenyl)-1H-pyrrol-1-yl)methyl)pyridin-2-amine | CHEMBL1091343
TypeSmall organic molecule
Emp. Form.C28H22ClN3O
Mol. Mass.451.947
SMILESNc1cccc(Cn2c(ccc2-c2ccccc2Cl)-c2ccc(Oc3ccccc3)cc2)n1