Reaction Details
TargetBeta-secretase 1
LigandBDBM50315018
Substrate/Competitorn/a
Meas. Tech.ChEMBL_624424 (CHEMBL1108752)
IC50 1650±n/a nM
Citation Malamas, MSBarnes, KHui, YJohnson, MLovering, FCondon, JFobare, WSolvibile, WTurner, JHu, YManas, ESFan, KOlland, AChopra, RBard, JPangalos, MNReinhart, PRobichaud, AJ Novel pyrrolyl 2-aminopyridines as potent and selective human beta-secretase (BACE1) inhibitors. Bioorg Med Chem Lett20:2068-73 (2010) 
 
Beta-secretase 1
Name:Beta-secretase 1
Type:Protein
Mol. Mass.:55755.10
Organism:Homo sapiens (Human)
Description:P56817
Residue:501
BDBM50315018
NameBDBM50315018
Synonyms:6-((2-(4-butoxyphenyl)-5-(2-chlorophenyl)-1H-pyrrol-1-yl)methyl)pyridin-2-amine | CHEMBL1090119
TypeSmall organic molecule
Emp. Form.C26H26ClN3O
Mol. Mass.431.957
SMILESCCCCOc1ccc(cc1)-c1ccc(-c2ccccc2Cl)n1Cc1cccc(N)n1