Reaction Details
TargetAmyloid-beta precursor protein
LigandBDBM50314997
Substrate/Competitorn/a
Meas. Tech.ChEMBL_624431 (CHEMBL1108759)
EC50 8600±n/a nM
Citation Malamas, MSBarnes, KHui, YJohnson, MLovering, FCondon, JFobare, WSolvibile, WTurner, JHu, YManas, ESFan, KOlland, AChopra, RBard, JPangalos, MNReinhart, PRobichaud, AJ Novel pyrrolyl 2-aminopyridines as potent and selective human beta-secretase (BACE1) inhibitors. Bioorg Med Chem Lett20:2068-73 (2010) 
 
Amyloid-beta precursor protein
Name:Amyloid-beta precursor protein
Type:Single-pass type I membrane protein
Mol. Mass.:86890.41
Organism:Homo sapiens (Human)
Description:P05067
Residue:770
BDBM50314997
NameBDBM50314997
Synonyms:CHEMBL1093806 | N-(4-(1-((6-aminopyridin-2-yl)methyl)-5-(2-chlorophenyl)-1H-pyrrol-2-yl)phenyl)pyrimidin-5-amine
TypeSmall organic molecule
Emp. Form.C26H21ClN6
Mol. Mass.452.938
SMILESNc1cccc(Cn2c(ccc2-c2ccccc2Cl)-c2ccc(Nc3cncnc3)cc2)n1