Reaction Details
TargetAmyloid-beta precursor protein
LigandBDBM50315000
Substrate/Competitorn/a
Meas. Tech.ChEMBL_624431 (CHEMBL1108759)
EC50 2200±n/a nM
Citation Malamas, MSBarnes, KHui, YJohnson, MLovering, FCondon, JFobare, WSolvibile, WTurner, JHu, YManas, ESFan, KOlland, AChopra, RBard, JPangalos, MNReinhart, PRobichaud, AJ Novel pyrrolyl 2-aminopyridines as potent and selective human beta-secretase (BACE1) inhibitors. Bioorg Med Chem Lett20:2068-73 (2010) 
 
Amyloid-beta precursor protein
Name:Amyloid-beta precursor protein
Type:Single-pass type I membrane protein
Mol. Mass.:86890.41
Organism:Homo sapiens (Human)
Description:P05067
Residue:770
BDBM50315000
NameBDBM50315000
Synonyms:6-((2-(2-chlorophenyl)-5-(4-(pyrimidin-5-yloxy)phenyl)-1H-pyrrol-1-yl)methyl)pyridin-2-amine CHEMBL1091999
TypeSmall organic molecule
Emp. Form.C26H20ClN5O
Mol. Mass.453.923
SMILESNc1cccc(Cn2c(ccc2-c2ccccc2Cl)-c2ccc(Oc3cncnc3)cc2)n1