Reaction Details
TargetSolute carrier family 12 member 5
LigandBDBM50315350
Substrate/Competitorn/a
Meas. Tech.ChEMBL_625987 (CHEMBL1103506)
IC50 790±n/a nM
Citation Pégurier, CBosman, NCollart, PDelporte, MLLeclercq, KLengelé, SKanduluru, AKMeunier, SPacico, NVadali, LRWagner, AWolff, CProvins, L Benzyl prolinate derivatives as novel selective KCC2 blockers. Bioorg Med Chem Lett20:2542-5 (2010) 
 
Solute carrier family 12 member 5
Name:Solute carrier family 12 member 5
Type:PROTEIN
Mol. Mass.:126249.28
Organism:Rattus norvegicus
Description:ChEMBL_818163
Residue:1139
BDBM50315350
NameBDBM50315350
Synonyms:(+)-benzyl 1-acetyl-2-benzylpyrrolidine-2-carboxylate (-)-benzyl 1-acetyl-2-benzylpyrrolidine-2-carboxylate | CHEMBL1091718
TypeSmall organic molecule
Emp. Form.C21H23NO3
Mol. Mass.337.4122
SMILESCC(=O)N1CCCC1(Cc1ccccc1)C(=O)OCc1ccccc1