Reaction Details
TargetSolute carrier family 12 member 5
LigandBDBM50315363
Substrate/Competitorn/a
Meas. Tech.ChEMBL_625987 (CHEMBL1103506)
IC50 320±n/a nM
Citation Pégurier, CBosman, NCollart, PDelporte, MLLeclercq, KLengelé, SKanduluru, AKMeunier, SPacico, NVadali, LRWagner, AWolff, CProvins, L Benzyl prolinate derivatives as novel selective KCC2 blockers. Bioorg Med Chem Lett20:2542-5 (2010) 
 
Solute carrier family 12 member 5
Name:Solute carrier family 12 member 5
Type:PROTEIN
Mol. Mass.:126249.28
Organism:Rattus norvegicus
Description:ChEMBL_818163
Residue:1139
BDBM50315363
NameBDBM50315363
Synonyms:CHEMBL1092336 | benzyl 1-acetyl-2-(3-cyanobenzyl)pyrrolidine-2-carboxylate
TypeSmall organic molecule
Emp. Form.C22H22N2O3
Mol. Mass.362.4217
SMILESCC(=O)N1CCCC1(Cc1cccc(c1)C#N)C(=O)OCc1ccccc1