Reaction Details
TargetSolute carrier family 12 member 5
LigandBDBM50315368
Substrate/Competitorn/a
Meas. Tech.ChEMBL_625987 (CHEMBL1103506)
IC50 50±n/a nM
Citation Pégurier, CBosman, NCollart, PDelporte, MLLeclercq, KLengelé, SKanduluru, AKMeunier, SPacico, NVadali, LRWagner, AWolff, CProvins, L Benzyl prolinate derivatives as novel selective KCC2 blockers. Bioorg Med Chem Lett20:2542-5 (2010) 
 
Solute carrier family 12 member 5
Name:Solute carrier family 12 member 5
Type:PROTEIN
Mol. Mass.:126249.28
Organism:Rattus norvegicus
Description:ChEMBL_818163
Residue:1139
BDBM50315368
NameBDBM50315368
Synonyms:CHEMBL1090182 | benzyl 1-acetyl-2-(4-methoxy-3-(trifluoromethyl)benzyl)pyrrolidine-2-carboxylate
TypeSmall organic molecule
Emp. Form.C23H24F3NO4
Mol. Mass.435.4362
SMILESCOc1ccc(CC2(CCCN2C(C)=O)C(=O)OCc2ccccc2)cc1C(F)(F)F