Reaction Details
TargetCytochrome P450 3A4
LigandBDBM50316513
Substrate/Competitorn/a
Meas. Tech.ChEMBL_631008 (CHEMBL1110979)
IC50 3300±n/a nM
Citation Yan, LHuo, PDebenham, JSMadsen-Duggan, CBLao, JChen, RZXiao, JCShen, CPStribling, DSShearman, LPStrack, AMTsou, NBall, RGWang, JTong, XBateman, TJReddy, VBFong, TMHale, JJ Discovery of N-[(4R)-6-(4-chlorophenyl)-7-(2,4-dichlorophenyl)-2,2-dimethyl-3,4-dihydro-2H-pyrano[2,3-b]pyridin-4-yl]-5-methyl-1H-pyrazole-3-carboxamide (MK-5596) as a novel cannabinoid-1 receptor (CB1R) inverse agonist for the treatment of obesity. J Med Chem53:4028-37 (2010) 
 
Cytochrome P450 3A4
Name:Cytochrome P450 3A4
Type:Enzyme
Mol. Mass.:57349.57
Organism:Homo sapiens (Human)
Description:n/a
Residue:503
BDBM50316513
NameBDBM50316513
Synonyms:CHEMBL1096182 | N-((4R)-6-(4-chlorophenyl)-7-(2,4-dichlorophenyl)-2,2-dimethyl-3,4-dihydro-2H-pyrano[2,3-b]pyridin-4-yl)-5-methyl-1H-pyrazole-3-carboxamide
TypeSmall organic molecule
Emp. Form.C27H23Cl3N4O2
Mol. Mass.541.856
SMILESCc1cc([nH]n1)C(=O)N[C@@H]1CC(C)(C)Oc2nc(-c3ccc(Cl)cc3Cl)c(cc12)-c1ccc(Cl)cc1