Reaction Details
TargetDynamin-2
LigandBDBM50316539
Substrate/Competitorn/a
Meas. Tech.ChEMBL_631207 (CHEMBL1110056)
IC50 1300000±n/a nM
Citation Hill, TAMariana, AGordon, CPOdell, LRRobertson, MJMcGeachie, ABChau, NDaniel, JAGorgani, NNRobinson, PJMcCluskey, A Iminochromene inhibitors of dynamins I and II GTPase activity and endocytosis. J Med Chem53:4094-102 (2010) 
 
Dynamin-2
Name:Dynamin-2
Type:PROTEIN
Mol. Mass.:98071.19
Organism:Homo sapiens (Human)
Description:ChEMBL_934670
Residue:870
BDBM50316539
NameBDBM50316539
Synonyms:CHEMBL1094850 | N,N'-(Ethane-1,2-diyl)bis(7,8-dihydroxy-2-imino-2H-chromene-3-carboxamide)
TypeSmall organic molecule
Emp. Form.C22H18N4O8
Mol. Mass.466.4003
SMILESOc1ccc2cc(C(=O)NCCNC(=O)c3cc4ccc(O)c(O)c4oc3=N)c(=N)oc2c1O