Reaction Details
TargetDynamin-2
LigandBDBM50316542
Substrate/Competitorn/a
Meas. Tech.ChEMBL_631207 (CHEMBL1110056)
IC50 10700±n/a nM
Citation Hill, TAMariana, AGordon, CPOdell, LRRobertson, MJMcGeachie, ABChau, NDaniel, JAGorgani, NNRobinson, PJMcCluskey, A Iminochromene inhibitors of dynamins I and II GTPase activity and endocytosis. J Med Chem53:4094-102 (2010) 
 
Dynamin-2
Name:Dynamin-2
Type:PROTEIN
Mol. Mass.:98071.19
Organism:Homo sapiens (Human)
Description:ChEMBL_934670
Residue:870
BDBM50316542
NameBDBM50316542
Synonyms:CHEMBL1098764 | N,N'-(Propane-1,3-diyl)bis(7,8-dihydroxy-2-imino-2H-chromene-3-carboxamide)
TypeSmall organic molecule
Emp. Form.C23H20N4O8
Mol. Mass.480.4269
SMILESOc1ccc2cc(C(=O)NCCCNC(=O)c3cc4ccc(O)c(O)c4oc3=N)c(=N)oc2c1O