Reaction Details
TargetSphingosine 1-phosphate receptor 3
LigandBDBM50316769
Substrate/Competitorn/a
Meas. Tech.ChEMBL_632514 (CHEMBL1111162)
IC50 2068±n/a nM
Citation Bolli, MHAbele, SBinkert, CBravo, RBuchmann, SBur, DGatfield, JHess, PKohl, CMangold, CMathys, BMenyhart, KMüller, CNayler, OScherz, MSchmidt, GSippel, VSteiner, BStrasser, DTreiber, AWeller, T 2-imino-thiazolidin-4-one derivatives as potent, orally active S1P1 receptor agonists. J Med Chem53:4198-211 (2010) 
 
Sphingosine 1-phosphate receptor 3
Name:Sphingosine 1-phosphate receptor 3
Type:G Protein-Coupled Receptor (GPCR)
Mol. Mass.:42278.13
Organism:Homo sapiens (Human)
Description:Q99500
Residue:378
BDBM50316769
NameBDBM50316769
Synonyms:(Z,Z)-5-[3-Chloro-4-((2R)-2,3-dihydroxy-propoxy)-benzylidene]-2-propylimino-3-o-tolyl-thiazolidin-4-one | CHEMBL1095833
TypeSmall organic molecule
Emp. Form.C23H25ClN2O4S
Mol. Mass.460.974
SMILESCCC\N=C1/S\C(=C/c2ccc(OC[C@@H](O)CO)c(Cl)c2)C(=O)N1c1ccccc1C