Reaction Details
TargetSphingosine 1-phosphate receptor 3
LigandBDBM50316734
Substrate/Competitorn/a
Meas. Tech.ChEMBL_632482 (CHEMBL1108346)
EC50 127±n/a nM
Citation Bolli, MHAbele, SBinkert, CBravo, RBuchmann, SBur, DGatfield, JHess, PKohl, CMangold, CMathys, BMenyhart, KMüller, CNayler, OScherz, MSchmidt, GSippel, VSteiner, BStrasser, DTreiber, AWeller, T 2-imino-thiazolidin-4-one derivatives as potent, orally active S1P1 receptor agonists. J Med Chem53:4198-211 (2010) 
 
Sphingosine 1-phosphate receptor 3
Name:Sphingosine 1-phosphate receptor 3
Type:G Protein-Coupled Receptor (GPCR)
Mol. Mass.:42278.13
Organism:Homo sapiens (Human)
Description:Q99500
Residue:378
BDBM50316734
NameBDBM50316734
Synonyms:(Z,Z)-5-(3-Chloro-4-hydroxy-benzylidene)-2-isopropylimino-3-(4-methoxy-phenyl)-thiazolidin-4-one | CHEMBL1096478
TypeSmall organic molecule
Emp. Form.C20H19ClN2O3S
Mol. Mass.402.894
SMILESCOc1ccc(cc1)N1\C(S\C(=C/c2ccc(O)c(Cl)c2)C1=O)=N\C(C)C