Reaction Details
TargetPotassium voltage-gated channel subfamily H member 2
LigandBDBM50316924
Substrate/Competitorn/a
Meas. Tech.ChEMBL_630100 (CHEMBL1110020)
Ki 1183±n/a nM
Citation Lavrador-Erb, KRavula, SBYu, JZamani-Kord, SMoree, WJPetroski, REWen, JMalany, SHoare, SRMadan, ACrowe, PDBeaton, G The discovery and structure-activity relationships of 2-(piperidin-3-yl)-1H-benzimidazoles as selective, CNS penetrating H1-antihistamines for insomnia. Bioorg Med Chem Lett20:2916-9 (2010) 
 
Potassium voltage-gated channel subfamily H member 2
Name:Potassium voltage-gated channel subfamily H member 2
Type:Multi-pass membrane protein
Mol. Mass.:126672.65
Organism:Homo sapiens (Human)
Description:Q12809
Residue:1159
BDBM50316924
NameBDBM50316924
Synonyms:2-((2-(1-cyclohexylpiperidin-3-yl)-1H-benzo[d]imidazol-1-yl)methyl)-4-methylthiazole | CHEMBL1095511
TypeSmall organic molecule
Emp. Form.C23H30N4S
Mol. Mass.394.576
SMILESCc1csc(Cn2c(nc3ccccc23)C2CCCN(C2)C2CCCCC2)n1