Reaction Details
TargetPotassium voltage-gated channel subfamily H member 2
LigandBDBM50316938
Substrate/Competitorn/a
Meas. Tech.ChEMBL_630100 (CHEMBL1110020)
Ki>10000±n/a nM
Citation Lavrador-Erb, KRavula, SBYu, JZamani-Kord, SMoree, WJPetroski, REWen, JMalany, SHoare, SRMadan, ACrowe, PDBeaton, G The discovery and structure-activity relationships of 2-(piperidin-3-yl)-1H-benzimidazoles as selective, CNS penetrating H1-antihistamines for insomnia. Bioorg Med Chem Lett20:2916-9 (2010) 
 
Potassium voltage-gated channel subfamily H member 2
Name:Potassium voltage-gated channel subfamily H member 2
Type:Multi-pass membrane protein
Mol. Mass.:126672.65
Organism:Homo sapiens (Human)
Description:Q12809
Residue:1159
BDBM50316938
NameBDBM50316938
Synonyms:1-(4-fluorobenzyl)-2-(1-methylpiperidin-3-yl)-1H-benzo[d]imidazole | CHEMBL1087089
TypeSmall organic molecule
Emp. Form.C20H22FN3
Mol. Mass.323.4072
SMILESCN1CCCC(C1)c1nc2ccccc2n1Cc1ccc(F)cc1