Reaction Details
Target11-beta-hydroxysteroid dehydrogenase 1
LigandBDBM50317216
Substrate/Competitorn/a
Meas. Tech.ChEMBL_631347 (CHEMBL1105684)
IC50 0.32±n/a nM
Citation Cheng, HHoffman, JLe, PNair, SKCripps, SMatthews, JSmith, CYang, MKupchinsky, SDress, KEdwards, MCole, BWalters, ELoh, CErmolieff, JFanjul, ABhat, GBHerrera, JPauly, THosea, NPaderes, GRejto, P The development and SAR of pyrrolidine carboxamide 11beta-HSD1 inhibitors. Bioorg Med Chem Lett20:2897-902 (2010) 
 
11-beta-hydroxysteroid dehydrogenase 1
Name:11-beta-hydroxysteroid dehydrogenase 1
Type:Enzyme
Mol. Mass.:32409.16
Organism:Homo sapiens (Human)
Description:P28845
Residue:292
BDBM50317216
NameBDBM50317216
Synonyms:(2R)-N-(adamantan-2-yl)-1-(cyclohexylmethyl)pyrrolidine-2-carboxamide | CHEMBL1097177
TypeSmall organic molecule
Emp. Form.C22H36N2O
Mol. Mass.344.534
SMILESO=C(NC1C2CC3CC(C2)CC1C3)[C@H]1CCCN1CC1CCCCC1