Reaction Details
Target11-beta-hydroxysteroid dehydrogenase 1
LigandBDBM50317217
Substrate/Competitorn/a
Meas. Tech.ChEMBL_631347 (CHEMBL1105684)
IC50 0.32±n/a nM
Citation Cheng, HHoffman, JLe, PNair, SKCripps, SMatthews, JSmith, CYang, MKupchinsky, SDress, KEdwards, MCole, BWalters, ELoh, CErmolieff, JFanjul, ABhat, GBHerrera, JPauly, THosea, NPaderes, GRejto, P The development and SAR of pyrrolidine carboxamide 11beta-HSD1 inhibitors. Bioorg Med Chem Lett20:2897-902 (2010) 
 
11-beta-hydroxysteroid dehydrogenase 1
Name:11-beta-hydroxysteroid dehydrogenase 1
Type:Enzyme
Mol. Mass.:32409.16
Organism:Homo sapiens (Human)
Description:P28845
Residue:292
BDBM50317217
NameBDBM50317217
Synonyms:(2R)-N-(adamantan-2-yl)-1-(2,2,2-trifluoroethyl)pyrrolidine-2-carboxamide | CHEMBL1097178
TypeSmall organic molecule
Emp. Form.C17H25F3N2O
Mol. Mass.330.3884
SMILESFC(F)(F)CN1CCC[C@@H]1C(=O)NC1C2CC3CC(C2)CC1C3