Reaction Details
Target11-beta-hydroxysteroid dehydrogenase 1
LigandBDBM50317219
Substrate/Competitorn/a
Meas. Tech.ChEMBL_631347 (CHEMBL1105684)
IC50 0.32±n/a nM
Citation Cheng, HHoffman, JLe, PNair, SKCripps, SMatthews, JSmith, CYang, MKupchinsky, SDress, KEdwards, MCole, BWalters, ELoh, CErmolieff, JFanjul, ABhat, GBHerrera, JPauly, THosea, NPaderes, GRejto, P The development and SAR of pyrrolidine carboxamide 11beta-HSD1 inhibitors. Bioorg Med Chem Lett20:2897-902 (2010) 
 
11-beta-hydroxysteroid dehydrogenase 1
Name:11-beta-hydroxysteroid dehydrogenase 1
Type:Enzyme
Mol. Mass.:32409.16
Organism:Homo sapiens (Human)
Description:P28845
Residue:292
BDBM50317219
NameBDBM50317219
Synonyms:(2R)-N-(adamantan-2-yl)-1-[(4-chlorophenyl)methyl]pyrrolidine-2-carboxamide | CHEMBL1097828
TypeSmall organic molecule
Emp. Form.C22H29ClN2O
Mol. Mass.372.931
SMILESClc1ccc(CN2CCC[C@@H]2C(=O)NC2C3CC4CC(C3)CC2C4)cc1