Reaction Details
Target11-beta-hydroxysteroid dehydrogenase 1
LigandBDBM50317226
Substrate/Competitorn/a
Meas. Tech.ChEMBL_631347 (CHEMBL1105684)
IC50 0.03±n/a nM
Citation Cheng, HHoffman, JLe, PNair, SKCripps, SMatthews, JSmith, CYang, MKupchinsky, SDress, KEdwards, MCole, BWalters, ELoh, CErmolieff, JFanjul, ABhat, GBHerrera, JPauly, THosea, NPaderes, GRejto, P The development and SAR of pyrrolidine carboxamide 11beta-HSD1 inhibitors. Bioorg Med Chem Lett20:2897-902 (2010) 
 
11-beta-hydroxysteroid dehydrogenase 1
Name:11-beta-hydroxysteroid dehydrogenase 1
Type:Enzyme
Mol. Mass.:32409.16
Organism:Homo sapiens (Human)
Description:P28845
Residue:292
BDBM50317226
NameBDBM50317226
Synonyms:(2R)-N-(adamantan-2-yl)-1-[(1-hydroxycyclohexyl)methyl]pyrrolidine-2-carboxamide | CHEMBL1096451
TypeSmall organic molecule
Emp. Form.C22H36N2O2
Mol. Mass.360.5334
SMILESOC1(CN2CCC[C@@H]2C(=O)NC2C3CC4CC(C3)CC2C4)CCCCC1