Reaction Details
Target11-beta-hydroxysteroid dehydrogenase 1
LigandBDBM50317224
Substrate/Competitorn/a
Meas. Tech.ChEMBL_631344 (CHEMBL1105681)
Ki 1±n/a nM
Citation Cheng, HHoffman, JLe, PNair, SKCripps, SMatthews, JSmith, CYang, MKupchinsky, SDress, KEdwards, MCole, BWalters, ELoh, CErmolieff, JFanjul, ABhat, GBHerrera, JPauly, THosea, NPaderes, GRejto, P The development and SAR of pyrrolidine carboxamide 11beta-HSD1 inhibitors. Bioorg Med Chem Lett20:2897-902 (2010) 
 
11-beta-hydroxysteroid dehydrogenase 1
Name:11-beta-hydroxysteroid dehydrogenase 1
Type:Enzyme
Mol. Mass.:32409.16
Organism:Homo sapiens (Human)
Description:P28845
Residue:292
BDBM50317224
NameBDBM50317224
Synonyms:(2R)-N-(adamantan-2-yl)-1-(oxan-4-ylmethyl)pyrrolidine-2-carboxamide | CHEMBL1095786
TypeSmall organic molecule
Emp. Form.C21H34N2O2
Mol. Mass.346.5069
SMILESO=C(NC1C2CC3CC(C2)CC1C3)[C@H]1CCCN1CC1CCOCC1