Reaction Details
TargetBeta-2 adrenergic receptor
LigandBDBM50318161
Substrate/Competitorn/a
Meas. Tech.ChEMBL_632379 (CHEMBL1115584)
Ki 218±n/a nM
Citation Baur, FBeattie, DBeer, DBentley, DBradley, MBruce, ICharlton, SJCuenoud, BErnst, RFairhurst, RAFaller, BFarr, DKeller, TFozard, JRFullerton, JGarman, SHatto, JHayden, CHe, HHowes, CJanus, DJiang, ZLewis, CLoeuillet-Ritzler, FMoser, HReilly, JSteward, ASykes, DTedaldi, LTrifilieff, ATweed, MWatson, SWissler, EWyss, D The identification of indacaterol as an ultralong-acting inhaled beta2-adrenoceptor agonist. J Med Chem53:3675-84 (2010) 
 
Beta-2 adrenergic receptor
Name:Beta-2 adrenergic receptor
Type:n/a
Mol. Mass.:46461.69
Organism:Homo sapiens (Human)
Description:P07550
Residue:413
BDBM50318161
NameBDBM50318161
Synonyms:8-Hydroxy-5-[(R)-1-hydroxy-2-(indan-2-ylamino)-ethyl]-1H-quinolin-2-one | CHEMBL1094323
TypeSmall organic molecule
Emp. Form.C20H20N2O3
Mol. Mass.336.3844
SMILESO[C@@H](CNC1Cc2ccccc2C1)c1ccc(O)c2[nH]c(=O)ccc12